{"text_format":"1","workbook":"xlsx","n_sheets":16,"sheets":["試算シートの使い方","入力シート","印刷シート ","【参考】調整額区分表","特に級読替表","給料表計算シート","給料表","計算シート","Sheet1","Sheet2","Sheet3","除算","H30.4.1","育休特殊事例入力方法","基本額式","7割措置"],"not_rendered":{"charts":0,"images":19,"macros":1,"external_links":1,"defined_names":81,"comments":4,"pivot_tables":0},"unopened":[],"bounds":{"document_bytes":16777216,"sheet_cells":100000,"rows_first":2000,"rows_last":500,"rows_between":2000,"halvings":0,"cell_chars":16384,"cell_head_chars":4096},"cells_cut":0,"cells_raw":0,"read":"whole","date_system":"1900"}

{"sheet":"試算シートの使い方","index":0,"n_rows":82,"n_cols":8,"rows_kept":82,"cut":false,"hidden":false,"merged":[[0,0,0,8],[3,1,3,5],[5,1,5,5],[8,1,8,8],[1,7,1,8],[4,1,4,5],[64,1,64,8],[65,1,65,8],[62,0,62,8],[79,1,79,2],[9,1,9,8]]}
["退職手当試算シート【定年扱い退職者用】の使用について"]
[null,null,null,null,null,null,null,"R7.6.17 現在"]
["１　用意するもの"]
["（１）"," 履歴書"]
["（２）"," 給与明細（満６０歳年度内最新のもの）"]
["（３）"," 給与明細（退職年度内最新のもの）"]
[]
["２　使用方法"]
["（１）"," 入力シートを開きます。"]
["（２）"," 入力シートの説明を参考に履歴書等を見ながら該当箇所に入力してください。"]
{"$rows_left_out":73}
{"sheet":"入力シート","index":1,"n_rows":171,"n_cols":81,"rows_kept":171,"cut":false,"hidden":false,"merged":[[109,65,110,71],[104,1,104,25],[105,23,106,25],[105,1,106,22],[104,29,104,53],[105,29,106,50],[105,51,106,53],[108,1,108,25],[108,29,108,53],[109,1,110,22],[109,23,110,25],[109,29,110,50],[109,51,110,53],[109,59,110,62],[105,65,106,71],[21,61,22,64],[21,68,22,72],[19,73,20,76],[21,73,22,76],[21,66,22,66],[46,67,46,69],[45,64,46,65],[45,57,46,63],[47,57,48,63],[25,1,25,64],[26,1,26,64],[29,15,29,28],[33,5,33,14],[33,26,33,28],[33,15,33,25],[23,1,24,14],[23,15,24,28],[21,1,22,14],[21,15,22,28],[21,35,22,48],[21,49,22,52],[21,53,22,56],[21,57,22,60],[28,5,28,14],[151,1,152,15],[153,1,154,15],[155,1,156,15],[157,1,158,15],[149,16,150,23],[151,16,152,23],[153,16,154,23],[155,16,156,23],[157,16,158,23],[149,24,150,30],[151,24,152,30],[153,24,154,30],[155,24,156,30],[157,24,158,30],[141,16,142,24],[129,1,130,15],[131,1,132,15],[133,1,134,15],[135,1,136,15],[137,1,138,15],[139,1,140,15],[141,1,142,15],[145,24,146,30],[145,16,146,23],[145,1,146,15],[129,16,130,24],[131,16,132,24],[133,16,134,24],[135,16,136,24],[137,16,138,24],[139,16,140,24],[131,25,132,30],[149,1,150,15],[142,66,142,70],[163,31,163,64],[141,55,142,63],[141,64,142,64],[139,58,140,63],[139,64,140,64],[157,43,158,50],[153,43,154,50],[155,43,156,50],[157,31,158,36],[157,37,158,42],[153,31,154,36],[153,37,154,42],[155,31,156,36],[155,37,156,42],[149,37,150,42],[149,43,150,50],[151,31,152,36],[151,37,152,42],[151,43,152,50],[149,31,150,36],[145,37,146,42],[145,43,146,50],[147,31,148,36],[137,31,138,36],[139,31,140,36],[137,37,138,44],[139,37,140,44],[141,37,142,44],[137,45,138,48],[141,45,142,48],[141,25,142,30],[141,31,142,36],[137,25,138,30],[139,25,140,30],[83,58,84,64],[147,37,148,42],[147,43,148,50],[145,31,146,36],[147,16,148,23],[147,24,148,30],[147,1,148,15],[36,5,36,14],[36,15,36,28],[37,5,37,14],[37,15,37,28],[37,29,37,32],[37,33,37,46],[39,15,39,28],[40,29,40,42],[41,5,41,14],[40,26,40,28],[40,15,40,25],[40,5,40,14],[41,15,41,25],[41,26,41,28],[41,29,41,42],[133,31,134,36],[135,31,136,36],[74,20,74,36],[74,39,74,55],[131,31,132,36],[82,1,82,17],[82,20,82,36],[82,39,82,55],[83,1,84,13],[83,14,84,17],[83,20,84,32],[83,33,84,36],[83,39,84,51],[83,52,84,55],[129,31,130,36],[2,39,2,47],[13,1,14,13],[2,52,2,63],[12,1,12,64],[13,16,13,53],[14,16,14,64],[19,15,20,28],[19,61,20,64],[19,49,20,52],[6,1,6,57],[9,1,10,13],[8,1,8,13],[19,35,20,48],[19,1,20,14],[19,57,20,60],[4,1,4,64],[31,15,31,28],[29,5,29,14],[32,61,32,64],[33,61,33,64],[32,29,32,42],[32,47,32,60],[32,15,32,25],[32,26,32,28],[28,15,28,28],[29,29,29,32],[29,33,29,46],[32,5,32,14],[33,29,33,42],[33,47,33,60],[32,74,33,76],[33,65,33,69],[32,65,32,69],[32,70,32,73],[33,70,33,73],[40,74,41,76],[40,70,40,73],[41,65,41,69],[41,70,41,73],[46,22,47,26],[46,27,47,28],[46,5,47,14],[69,39,69,47],[70,39,71,47],[69,1,69,17],[70,33,71,36],[41,80,42,80],[41,79,42,79],[41,78,42,78],[41,77,42,77],[45,44,46,56],[47,44,48,56],[45,32,47,43],[48,32,48,43],[41,47,41,60],[41,61,41,64],[45,15,45,28],[69,20,69,36],[45,1,47,4],[46,15,47,19],[47,64,48,65],[46,20,47,21],[50,1,50,64],[162,55,162,58],[162,46,162,54],[155,64,156,64],[157,55,158,63],[157,64,158,64],[70,20,71,24],[70,25,71,27],[70,28,71,32],[70,52,71,55],[86,1,86,62],[88,1,88,62],[78,39,78,55],[70,1,71,17],[75,20,76,24],[75,25,76,27],[75,28,76,32],[73,39,73,55],[79,14,80,17],[79,33,80,36],[126,1,126,64],[75,52,76,55],[78,20,78,36],[75,33,76,36],[75,17,75,19],[73,20,73,36],[139,52,140,57],[79,1,80,13],[155,52,156,57],[160,31,161,47],[160,48,161,60],[155,58,156,63],[79,39,80,51],[79,52,80,55],[78,1,78,17],[87,1,87,62],[105,59,106,62],[160,61,161,64],[131,45,132,48],[133,37,134,44],[133,25,134,30],[135,25,136,30],[133,45,134,48],[135,45,136,48],[125,1,125,64],[129,45,130,48],[129,25,130,30],[74,1,76,16],[75,39,76,51],[19,68,20,72],[19,53,20,56],[135,37,136,44],[129,37,130,44],[131,37,132,44],[79,58,80,64],[79,20,80,32],[1,1,1,64],[45,72,45,77],[46,72,46,77],[19,66,20,66],[28,48,28,57],[29,48,29,52],[29,53,29,55],[29,56,29,61],[29,62,29,65],[36,48,36,57],[37,48,37,52],[37,53,37,55],[37,56,37,61],[37,62,37,65],[40,65,40,69],[40,61,40,64],[40,47,40,60]]}
[]
[null,"退職手当試算入力シート【定年扱い退職者用】"]
[null,null,null,null,null,null,null,null,null,null,null,null,null,null,null,null,null,null,null,null,null,null,null,null,null,null,null,null,null,null,null,null,null,null,null,null,null,null,null,"入力箇所(必須）",null,null,null,null,null,null,null,null,null,null,null,null,"入力箇所（場合によって）"]
[]
[null,"こちらのシートは、定年引上げ後の定年扱い退職年度に退職される方の、おおよその退職手当額を試算します。\n正確な退職手当額は昇給等を考慮した上で決定されることとなりますので、参考程度にお考えください。\n黄色セル、（場合によっては）青色セルに入力してください。"]
[]
[1,"試算希望者の氏名を入力してください。"]
[]
[null,"氏　　名"]
[null,"福　花子"]
{"$rows_left_out":162}
{"sheet":"印刷シート ","index":2,"n_rows":42,"n_cols":39,"rows_kept":42,"cut":false,"hidden":false,"merged":[[9,5,9,11],[21,9,21,11],[8,25,8,26],[18,10,18,18],[26,5,26,22],[27,16,27,17],[27,5,27,6],[27,8,27,9],[27,11,27,12],[27,14,27,15],[27,18,27,19],[27,21,27,22],[16,5,16,11],[16,12,16,13],[16,16,17,18],[17,5,17,11],[17,12,17,13],[17,14,17,15],[12,12,12,13],[13,12,13,13],[10,11,11,11],[10,13,11,13],[8,5,8,11],[8,12,8,13],[8,21,8,22],[13,14,13,15],[30,1,35,1],[5,9,5,11],[5,5,5,7],[10,10,11,10],[10,12,11,12],[26,1,27,4],[28,1,29,4],[28,5,29,18],[14,5,14,11],[14,12,14,13],[15,5,15,11],[15,12,15,13],[12,5,12,11],[13,5,13,11],[9,12,9,13],[9,1,9,4],[10,3,11,4],[8,2,8,4],[10,5,10,8],[11,5,11,8],[21,14,21,17],[10,1,19,2],[10,20,11,20],[10,22,11,22],[11,14,11,17],[14,16,15,18],[14,20,15,20],[15,14,15,15],[12,20,13,20],[12,22,13,22],[21,12,21,13],[12,16,13,18],[16,22,17,22],[14,19,15,19],[2,12,2,15],[22,1,23,4],[22,5,23,18],[22,19,23,22],[10,19,11,19],[10,21,11,21],[12,21,13,21],[14,21,15,21],[16,21,17,21],[12,19,13,19],[9,14,9,20],[9,21,9,22],[20,1,21,4],[20,12,20,13],[20,5,20,11],[20,14,20,20],[20,21,20,22],[21,5,21,8],[12,3,18,4],[16,20,17,20],[14,22,15,22],[16,19,17,19],[6,14,6,20],[21,18,21,20],[1,16,1,20],[1,21,1,22],[2,10,2,11],[2,16,2,20],[7,12,7,13],[1,1,2,9],[1,10,1,11],[4,1,7,1],[4,2,5,4],[6,2,6,4],[7,2,7,4],[4,5,4,13],[6,12,6,13],[5,12,5,13],[6,5,6,11],[7,5,7,11],[3,14,3,22],[3,5,3,13],[6,21,6,22],[7,14,7,20],[7,21,7,22],[4,14,5,22],[3,1,3,4],[1,12,1,15],[36,2,36,5],[36,6,36,8],[37,2,37,5],[37,6,37,8],[38,6,38,8],[39,6,39,8],[8,14,8,20],[40,6,40,8],[41,6,41,8],[33,6,33,8],[34,6,34,8],[35,6,35,8],[30,6,30,8],[31,6,31,8],[32,6,32,8],[28,19,29,22],[24,1,25,4],[24,5,24,13],[25,15,25,16],[25,12,25,14],[25,9,25,10],[25,5,25,7],[21,21,21,22],[10,14,10,17]]}
[]
[null,"退職手当計算内訳書　（試算）",null,null,null,null,null,null,null,null,"氏名：",null,{"$f":"IF(入力シート!B10=\"\",\"\",入力シート!B10)","v":"福　花子"},null,null,null,{"$f":"TODAY()","v":"2025-08-08"},null,null,null,null,"現在",null,null,null,null,null,null,null,{"$f":"IF(入力シート!B14=\"自己都合\",\"自己都合\",IF(入力シート!B14=\"定年扱い\",\"定年扱い\"))","v":"定年扱い"}]
[null,null,null,null,null,null,null,null,null,null,"事由：",null,{"$f":"$AD$2&\"退職\"","v":"定年扱い退職"}]
[null,"給与等",null,null,null,"満60歳年度の給料月額",null,null,null,null,null,null,null,null,"退職時の給料月額"]
[null,"給料月額","級号俸",null,null,{"$f":"入力シート!B71","v":"教育（二）"}]
[null,null,null,null,null,{"$f":"IF(入力シート!U71=\"\",\"\",IF(F7=入力シート!AN76,入力シート!U76,入力シート!U71))","v":3},null,null,"級",{"$f":"IF(入力シート!AC71=\"\",\"\",IF(F7=入力シート!AN76,入力シート!AC76,入力シート!AC71))","v":50},null,null,"号俸"]
[null,null,"給料",null,null,{"$f":"入力シート!$B$80+入力シート!$B$106","v":397900},null,null,null,null,null,null,"円",null,{"$f":"入力シート!$B$84+入力シート!$B$110","v":278500},null,null,null,null,null,null,"円"]
[null,null,"教職調整額",null,null,{"$f":"入力シート!$U$80+入力シート!$AD$106","v":7500},null,null,null,null,null,null,"円",null,{"$f":"入力シート!$U$84+入力シート!$AD$110","v":11140},null,null,null,null,null,null,"円"]
[null,null,"給料の調整額",null,null,{"$f":"入力シート!AN80","v":0},null,null,null,null,null,null,"円",null,{"$f":"入力シート!AN84","v":0},null,null,null,null,null,null,"円",null,null,{"$f":"K11*12+M11","v":420},{"$f":"T11*12+V11","v":432}]
[null,"　　計",null,null,null,{"$f":"SUM(F7:L9)","v":405400},null,null,null,null,null,null,"円（Ａ）",null,{"$f":"SUM(O7:U9)","v":289640},null,null,null,null,null,null,"円（Ｂ）"]
{"$rows_left_out":33}
{"sheet":"【参考】調整額区分表","index":3,"n_rows":44,"n_cols":11,"rows_kept":44,"cut":false,"hidden":false,"merged":[]}
["退職手当の調整額に関する区分表"]
[]
["イ　１９年３月３１日までの適用区分"]
["区分","第１号","第２号","第３号","第４号","第５号","第６号","第７号","第８号","第９号","第１０号"]
["調整月額",78750,70400,65000,59550,54150,43350,32500,27100,21700,0]
["行政職",null,null,"１１級\n期20%","１０級\n期20%","９級\n期15%","８級\n期15%","７級\n期10%","６級\n期10%","５級・４級\n期5%","３級・２級・１級"]
["教育職(二)",null,null,null,"４級\n期20%","４級\n管16%・管14%\n期15%","４級\n期15%","３級　期10%\n２級期10%のうち注８の者","２級\n期10%","２級・１級\n期5%","２級・１級"]
["教育職(三)",null,null,null,"４級\n期20%","４級\n管16%・管14%\n期15%","４級\n期15%","３級　期10%\n２級期10%のうち注８の者","２級\n期10%","２級\n期5%","２級・１級"]
["研究職",null,null,"５級\n管25%\n期20%","５級\n期20%","４級\n管18%\n期15%","４級 期15%\n３級のうち注４の職","３級のうち注５の職","３級\n期10%","２級\n期5%","２級・１級"]
["医療職(二)\n医療職(三)",null,null,null,null,"７級\n期15%","６級\n期15%","５級のうち注６の職","５級\n期10%","４級  期5%\n３級　期5%","3級・2級・1級"]
{"$rows_left_out":35}
{"sheet":"特に級読替表","index":4,"n_rows":67,"n_cols":23,"rows_kept":67,"cut":false,"hidden":true,"merged":[[11,23,11,24],[3,15,4,16],[3,17,4,18],[3,19,4,20],[3,21,4,22],[3,23,4,24],[7,21,7,22],[7,23,7,24],[8,23,8,24],[10,23,10,24],[8,21,8,22],[9,21,9,22],[9,23,9,24],[10,21,10,22],[11,21,11,22],[3,1,4,1],[7,1,7,2],[8,1,8,2],[36,1,36,2],[48,1,48,2],[63,1,63,2],[5,3,5,20],[17,17,18,18],[17,19,18,20],[9,1,9,2],[10,1,10,2],[28,1,28,16],[38,18,38,20],[60,14,60,20],[19,3,19,10],[38,1,38,2],[44,11,45,12],[17,1,18,1],[17,3,18,4],[17,5,18,6],[17,7,18,8],[17,15,18,16],[44,3,45,4],[44,5,45,6],[66,1,66,2],[30,1,31,1],[30,3,31,4],[30,5,31,6],[65,1,65,2],[64,1,64,2],[46,1,47,2],[49,1,49,2],[41,1,41,12],[62,1,62,2],[60,3,60,12],[60,1,61,2],[44,9,45,10],[44,7,45,8],[51,1,51,2],[55,1,55,12],[58,9,59,10],[52,1,52,2],[58,11,59,12],[58,1,59,1],[58,3,59,4],[58,5,59,6],[58,7,59,8],[44,1,45,1],[50,1,50,2],[14,1,14,10],[37,1,37,2],[21,1,21,2],[22,1,22,2],[23,1,23,2],[24,1,24,2],[30,7,31,8],[30,9,31,10],[17,9,18,10],[0,1,0,20],[14,13,14,20],[35,18,35,20],[36,18,36,20],[37,18,37,20],[34,1,34,2],[30,11,31,12],[30,13,31,14],[28,18,28,20],[17,13,18,14],[19,13,19,20],[5,1,6,2],[3,9,4,10],[3,11,4,12],[11,1,11,2],[3,13,4,14],[3,3,4,4],[3,5,4,6],[3,7,4,8],[35,1,35,2],[19,1,20,2],[32,1,33,2],[25,1,25,2],[30,18,30,20],[62,14,62,20],[63,14,63,20],[64,14,64,20],[65,14,65,20],[41,13,41,21],[31,18,31,20],[32,18,32,20],[33,18,33,20],[34,18,34,20],[30,15,31,16],[61,14,61,20],[48,14,48,20]]}
[null,"行　政　職　給　料　表"]
[]
[]
[null,null,"職務","１　級",null," ２　級",null,"３　級",null,"４　級",null,"５　級",null,"６　級",null,"７　級",null,"８　級",null,"９　級"]
[null,null,"の級"]
[null,"特　に",null,"読　替　号　俸"]
[null,null,null,null,"号俸",null,"号俸",null,"号俸",null,"号俸",null,"号俸",null,"号俸",null,"号俸",null,"号俸",null,"号俸"]
[null,"特(1)",null,189000,17,245400,20,317400,33,364700,29,382200,27,417900,25,428400,23,452300,22,488400,19]
[null,"特(2)",null,190600,{"$f":"E8+1","v":18},247200,{"$f":"G8+1","v":21},319200,{"$f":"I8+1","v":34},366900,{"$f":"K8+1","v":30},384800,{"$f":"M8+1","v":28},421300,{"$f":"O8+1","v":26},431900,{"$f":"Q8+1","v":24},455900,{"$f":"S8+1","v":23},492500,{"$f":"U8+1","v":20}]
[null,"特(3)",null,192200,{"$f":"E9+1","v":19},249000,{"$f":"G9+1","v":22},321000,{"$f":"I9+1","v":35},369100,{"$f":"K9+1","v":31},387400,{"$f":"M9+1","v":29},424700,{"$f":"O9+1","v":27},435400,{"$f":"Q9+1","v":25},459500,{"$f":"S9+1","v":24},496600,{"$f":"U9+1","v":21}]
{"$rows_left_out":58}
{"sheet":"給料表計算シート","index":5,"n_rows":25,"n_cols":7,"rows_kept":25,"cut":false,"hidden":true,"merged":[[11,2,11,3],[20,2,20,3]]}
["１　現在の給料表"]
[]
[null,null,null,null,"給料表","調整額"]
["行政",{"$f":"IF(入力シート!$B$71=\"行政\",入力シート!$B$71,\"\")","v":""},{"$f":"IF(B4=\"\",\"\",入力シート!$U$71)","v":""},{"$f":"IF(B4=\"\",\"\",入力シート!$AC$71)","v":""},{"$f":"IF(B4=\"\",\"\",VLOOKUP($D$16,給料表!$B$2:$C$3550,2,0))","v":""},{"$f":"IF(B4=\"\",\"\",VLOOKUP($D$17,給料表!$F$2:$G$3550,2,0))","v":""},{"$f":"IF(B4=\"\",\"\",1)","v":""}]
["教育（一）",{"$f":"IF(入力シート!$B$71=\"教育（一）\",入力シート!$B$71,\"\")","v":""},{"$f":"IF(B5=\"\",\"\",入力シート!$U$71)","v":""},{"$f":"IF(B5=\"\",\"\",入力シート!$AC$71)","v":""},{"$f":"IF(B5=\"\",\"\",VLOOKUP($D$16,給料表!$B$2:$C$3550,2,0))","v":""},{"$f":"IF(B5=\"\",\"\",VLOOKUP($D$17,給料表!$F$2:$G$3550,2,0))","v":""},{"$f":"IF(B5=\"\",\"\",4)","v":""}]
["教育（二）",{"$f":"IF(入力シート!$B$71=\"教育（二）\",入力シート!$B$71,\"\")","v":"教育（二）"},{"$f":"IF(B6=\"\",\"\",入力シート!$U$71)","v":3},{"$f":"IF(B6=\"\",\"\",入力シート!$AC$71)","v":50},{"$f":"IF(B6=\"\",\"\",VLOOKUP($D$16,給料表!$B$2:$C$3550,2,0))","v":397900},{"$f":"IF(B6=\"\",\"\",VLOOKUP($D$17,給料表!$F$2:$G$3550,2,0))","v":12000},{"$f":"IF(B6=\"\",\"\",5)","v":5}]
["研究",{"$f":"IF(入力シート!$B$71=\"研究\",入力シート!$B$71,\"\")","v":""},{"$f":"IF(B7=\"\",\"\",入力シート!$U$71)","v":""},{"$f":"IF(B7=\"\",\"\",入力シート!$AC$71)","v":""},{"$f":"IF(B7=\"\",\"\",VLOOKUP($D$16,給料表!$B$2:$C$3550,2,0))","v":""},{"$f":"IF(B7=\"\",\"\",VLOOKUP($D$17,給料表!$F$2:$G$3550,2,0))","v":""},{"$f":"IF(B7=\"\",\"\",6)","v":""}]
["技能",{"$f":"IF(入力シート!$B$71=\"技能\",入力シート!$B$71,\"\")","v":""},{"$f":"IF(B8=\"\",\"\",入力シート!$U$71)","v":""},{"$f":"IF(B8=\"\",\"\",入力シート!$AC$71)","v":""},{"$f":"IF(B8=\"\",\"\",VLOOKUP($D$16,給料表!$B$2:$C$3550,2,0))","v":""},{"$f":"IF(B8=\"\",\"\",VLOOKUP($D$17,給料表!$F$2:$G$3550,2,0))","v":""},{"$f":"IF(B8=\"\",\"\",10)","v":""}]
["医療（二）",{"$f":"IF(入力シート!$B$71=\"医療（二）\",入力シート!$B$71,\"\")","v":""},{"$f":"IF(B9=\"\",\"\",入力シート!$U$71)","v":""},{"$f":"IF(B9=\"\",\"\",入力シート!$AC$71)","v":""},{"$f":"IF(B9=\"\",\"\",VLOOKUP($D$16,給料表!$B$2:$C$3550,2,0))","v":""},{"$f":"IF(B9=\"\",\"\",VLOOKUP($D$17,給料表!$F$2:$G$3550,2,0))","v":""},{"$f":"IF(B9=\"\",\"\",8)","v":""}]
["医療（三）",{"$f":"IF(入力シート!$B$71=\"医療（三）\",入力シート!$B$71,\"\")","v":""},{"$f":"IF(B10=\"\",\"\",入力シート!$U$71)","v":""},{"$f":"IF(B10=\"\",\"\",入力シート!$AC$71)","v":""},{"$f":"IF(B10=\"\",\"\",VLOOKUP($D$16,給料表!$B$2:$C$3550,2,0))","v":""},{"$f":"IF(B10=\"\",\"\",VLOOKUP($D$17,給料表!$F$2:$G$3550,2,0))","v":""},{"$f":"IF(B10=\"\",\"\",9)","v":""}]
{"$rows_left_out":16}
{"sheet":"給料表","index":6,"n_rows":3550,"n_cols":7,"rows_kept":3550,"cut":false,"hidden":true,"merged":[]}
["2024-04-01","表級号","金額",null,"調整額","表級","金額"]
["給料表",101001,185000,null,"給料表",101,6700]
[null,101002,186100,null,null,102,8600]
[null,101003,187300,null,null,103,9800]
[null,101004,188400,null,null,104,10500]
[null,101005,189500,null,null,105,10800]
[null,101006,191200,null,null,106,11400]
[null,101007,192900,null,null,107,12300]
[null,101008,194500,null,null,108,13000]
[null,101009,196100,null,null,109,14700]
{"$rows_left_out":3541}
{"sheet":"計算シート","index":7,"n_rows":44,"n_cols":14,"rows_kept":44,"cut":false,"hidden":true,"merged":[[39,3,39,9],[48,3,48,14],[41,0,41,6],[23,3,23,9],[15,3,15,14],[17,3,17,15],[19,3,19,14]]}
["条例改正に伴う退職手当額試算シート",null,null,null,null,null,null,null,null,null,"ver3.0"]
[null,null,null,null,null,null,null,null,null,null,null,null,"自己都合"]
["１．H３０.３.３１に退職した場合",null,null,null,null,null,null,null,null,null,null,null,"定年・勧奨"]
[]
[null,null,null,"年齢(H30.3.31)",null,"※１勤続年数",null,"※２給料月額(現在)",null,null,{"$f":"MAX(H6:H9)","v":405400},{"$f":"IF(入力シート!#REF!=0,1251000,入力シート!#REF!)","v":{"$error":"#REF!"}}]
[null,null,null,null,null,{"$f":"'印刷シート '!K20","v":33},null,{"$f":"入力シート!BG80","v":405400},null,"新条例",{"$f":"IF(F9=1,VLOOKUP($F$6,'H30.4.1'!A5:C50,3,FALSE),VLOOKUP($F$6,'H30.4.1'!A5:C50,2,FALSE))","v":45.323550000000004},{"$f":"SUM(K5*K6)+L5","v":{"$error":"#REF!"}}]
[null,null,null,null,null,{"$f":"'印刷シート '!T20","v":34},"定年引上げ後",null,null,"定年引上げ後",{"$f":"IF(F9=1,VLOOKUP($F$7,'H30.4.1'!A6:C51,3,FALSE),VLOOKUP($F$7,'H30.4.1'!A6:C51,2,FALSE))","v":46.830150000000003}]
[null,null,null,"退職区分",null,null,null,"退職手当上の給料月額"]
[null,null,null,{"$f":"入力シート!B14","v":"定年扱い"},null,{"$f":"IF(D9=\"自己都合\",1,2)","v":2},null,{"$f":"IF(AND($D$9=\"定年\",F6>24),H6*VLOOKUP(D6,#REF!,2,FALSE),H6)","v":405400}]
[]
{"$rows_left_out":35}
{"sheet":"Sheet1","index":8,"n_rows":36,"n_cols":4,"rows_kept":36,"cut":false,"hidden":true,"merged":[[33,1,34,2],[33,3,34,11],[35,1,37,2],[35,3,37,11],[8,1,8,9],[29,3,32,11],[29,1,32,2]]}
[]
[null,"行政職給料表が適用されている者"]
[null,"　退職時前５年間の号俸を確認してください。"]
[null,"　例１）退職時前５年間　２級　である。"]
[null,"　　　　第10号区分に　６０月　と入力します。"]
[null,"　例２）退職時より３年前に４級に昇給し、それ以前は３級であった。"]
[null,"　　　　第9号区分に　２４月（２年間）、第8号区分に　３６月（３年間）と入力します。"]
[]
[null,"教職職給料表(一)(二)が適用されている者"]
[null,"　校長職にある者・・・第５号区分に　６０月　と入力"]
{"$rows_left_out":27}
{"sheet":"Sheet2","index":9,"n_rows":21,"n_cols":11,"rows_kept":21,"cut":false,"hidden":true,"merged":[]}
["次年度　調整額計算"]
[]
[null,"前年度a"]
[null,null,"4号","５号","６号","7号","8号","9号","10号","合計"]
[null,null,{"$f":"入力シート!#REF!","v":{"$error":"#REF!"}},{"$f":"入力シート!#REF!","v":{"$error":"#REF!"}},{"$f":"入力シート!#REF!","v":{"$error":"#REF!"}},{"$f":"入力シート!#REF!","v":{"$error":"#REF!"}},{"$f":"入力シート!#REF!","v":{"$error":"#REF!"}},{"$f":"入力シート!#REF!","v":{"$error":"#REF!"}},{"$f":"入力シート!#REF!","v":{"$error":"#REF!"}},{"$f":"SUM(C5:I5)","v":{"$error":"#REF!"}},{"$f":"IF(J5<60,J5+12,J5)","v":{"$error":"#REF!"}}]
[null,"a＋12",{"$f":"IF(C5>0,C5+12,C5)","v":{"$error":"#REF!"}},{"$f":"IF(D5>0,D5+12,D5)","v":{"$error":"#REF!"}},{"$f":"IF(AND(D5=0,E5>0),E5+12,E5)","v":{"$error":"#REF!"}},{"$f":"IF(AND(E5=0,F5>0),F5+12,F5)","v":{"$error":"#REF!"}},{"$f":"IF(AND(F5=0,G5>0),G5+12,G5)","v":{"$error":"#REF!"}},{"$f":"IF(AND(G5=0,H5>0),H5+12,H5)","v":{"$error":"#REF!"}},{"$f":"IF(AND(H5=0,I5>0),I5+12,I5)","v":{"$error":"#REF!"}}]
[null,null,{"$f":"IF(C6>60,60,C6)","v":{"$error":"#REF!"}},{"$error":"#REF!"},{"$error":"#REF!"},{"$error":"#REF!"},{"$error":"#REF!"},{"$error":"#REF!"},{"$error":"#REF!"}]
[null,"a-12",{"$f":"C5-12","v":{"$error":"#REF!"}},{"$error":"#REF!"},{"$error":"#REF!"},{"$error":"#REF!"},{"$error":"#REF!"},{"$error":"#REF!"},{"$error":"#REF!"}]
[null,null,1,2,3,4,5,6,7]
[null,1,{"$f":"$C$7","v":{"$error":"#REF!"}},{"$f":"IF(AND(C5=0),$D$7,D5)","v":{"$error":"#REF!"}},{"$f":"IF(AND(C5=0,D5=0),$E$7,E5)","v":{"$error":"#REF!"}},{"$f":"IF(AND(C5=0,D5=0,E5=0),$F$7,F5)","v":{"$error":"#REF!"}},{"$f":"IF(AND(D5=0,E5=0,F5=0,C5=0),$G$7,G5)","v":{"$error":"#REF!"}},{"$f":"IF(AND(C5=0,E5=0,F5=0,G5=0,D5=0),$H$7,H5)","v":{"$error":"#REF!"}},{"$f":"IF(I$8<0,I$6-I$6,I$6-12)","v":{"$error":"#REF!"}},{"$f":"SUM(C10:I10)","v":{"$error":"#REF!"}},1]
{"$rows_left_out":12}
{"sheet":"Sheet3","index":10,"n_rows":22,"n_cols":13,"rows_kept":22,"cut":false,"hidden":true,"merged":[[19,4,19,13],[21,4,21,13],[15,11,15,13],[19,1,19,2],[21,1,21,2],[17,1,17,2],[14,1,14,3],[14,5,14,7],[14,9,14,10],[14,12,14,13],[17,4,17,13]]}
[]
[]
[]
[]
[]
[]
[]
[]
[]
[]
{"$rows_left_out":13}
{"sheet":"除算","index":11,"n_rows":11,"n_cols":7,"rows_kept":11,"cut":false,"hidden":true,"merged":[]}
[null,"除算１",null,null,null,"除算２"]
[]
[null,"休職",2,null,null,"休職",2]
[null,"停職",2,null,null,"停職",2]
[null,"大学院修学",2,null,null,"大学院修学",2]
[null,"育休",3,null,null,"育休",2]
[null,"育短勤務",3,null,null,"育短勤務",3]
[null,"高齢者部分休業",2,null,null,"高齢者部分休業",2]
[null,"組合専従",1,null,null,"組合専従",1]
[null,"自己啓発",1,null,null,"自己啓発",1]
{"$rows_left_out":2}
{"sheet":"H30.4.1","index":12,"n_rows":50,"n_cols":8,"rows_kept":50,"cut":false,"hidden":true,"merged":[]}
[null,null,null,null,null,"新支給率"]
[null,null,null,"新"]
[null,"定年","自己都合",null,null,null,"1985-03-31",{"$f":"DATEVALUE(G3)","v":{"$error":"#VALUE!"}}]
[" 年  数"]
[0,null,0]
[1,0.83700000000000008,0.50219999999999998]
[2,1.6740000000000002,1.0044]
[3,2.5110000000000001,1.5065999999999999]
[4,3.3480000000000003,2.0087999999999999]
[5,4.1849999999999996,2.5110000000000001]
{"$rows_left_out":41}
{"sheet":"育休特殊事例入力方法","index":13,"n_rows":40,"n_cols":3,"rows_kept":40,"cut":false,"hidden":true,"merged":[[7,1,7,9],[0,1,1,9],[3,1,3,9],[4,1,4,9],[5,1,5,9],[6,1,6,9],[23,1,23,9],[36,2,36,9],[37,2,37,9],[39,1,41,9],[8,1,8,9],[24,1,24,9],[15,1,15,9],[16,1,16,9],[20,2,20,9],[21,2,21,9],[9,1,9,9],[10,1,10,9],[11,1,11,9],[12,1,12,9],[13,1,13,9],[14,1,14,9]]}
[null,"育児休業から復帰後、再度、同一の子の育児休業を取得した場合について"]
[]
[]
[null,"　入力シートの除算期間の子の誕生日欄は、行毎に子の誕生日が異なることを想定していますので、"]
[null,"期間を空けて同じ子の育児休業を取得した場合は、正しく計算されない事があります。"]
[null,"その場合は、お手数をおかけしますが下記のとおり入力してください。"]
[]
[null,"①子どもの１歳の誕生日を越えて、１回目の育児休業を取得した場合"]
[null,"※１歳の誕生日：H23.5.26"]
[]
{"$rows_left_out":31}
{"sheet":"基本額式","index":14,"n_rows":6,"n_cols":2,"rows_kept":6,"cut":false,"hidden":true,"merged":[[15,27,20,30],[5,1,7,4]]}
[]
[]
[]
[]
[]
[null,"退職手当\nの基本額"]

{"sheet":"7割措置","index":15,"n_rows":12,"n_cols":38,"rows_kept":12,"cut":false,"hidden":true,"merged":[[5,0,5,3],[16,27,19,30]]}
[]
[]
[]
[]
[]
[]
[]
[null,null,null,null,null,null,null,null,null,null,null,null,null,null,null,null,null,null,null,null,null,null,null,null,null,null,null,null,null,null,null,null,null,null,null,null,null,"別の図を組み合わせている箇所"]
[null,null,null,null,null,null,null,null,null,null,null,null,null,null,null,null,null,null,null,null,null,null,null,null,null,null,null,null,null,null,null,null,null,null,null,null,null,"・「６０歳」と吹き出し"]
[null,null,null,null,null,null,null,null,null,null,null,null,null,null,null,null,null,null,null,null,null,null,null,null,null,null,null,null,null,null,null,null,null,null,null,null,null,"・「退職時」と吹き出し"]
{"$rows_left_out":2}